דילוג לתוכן
  • 0 הצבעות
    15 פוסטים
    90 צפיות
    דאנציגד
    @יתברך-שמך לא, הגרסה המלאה כוללת את הספרייה.
  • 0 הצבעות
    4 פוסטים
    95 צפיות
    I
    ניסיתי לעדכן דרך ה-apk, אבל ה-samsung שלי לא מאפשר אפילו אסמן לו שאפשר להתקין תוכנות חיצוניות. מתי תופיע הגירסה החדשה ב-google play?
  • 7 הצבעות
    191 פוסטים
    2k צפיות
    צדיק וטוב לוצ
    @חד-צורבא אז איך בתצוגת מפרשים הוא כן שומר על סדר? כך או זה - בתכל'ס כל המפרשים הם בעצם ספר קיים במקורו בנפרד, ההוראה צריכה להיות שבמקרה של כמה חתיכות על קטע אחד - שיציג אותם על פי הסדר בספר המפרש המקורי. (כלומר: נניח רש"י על יבמות, הרי הוא גם מוגדר כספר בשם רש"י על יבמות, ושם הוא הרי כסדרו)
  • 0 הצבעות
    4 פוסטים
    39 צפיות
    אברהם mchא
    לא ידעתי...
  • 0 הצבעות
    9 פוסטים
    149 צפיות
    ח
    @בן-ישיבה https://github.com/Otzaria/otzaria/releases
  • 0 הצבעות
    3 פוסטים
    81 צפיות
    י
    @יום-חדש-מתחיל התכוונתי שאחרי שנבחר כבר הטקסט כולל הנקודתיים שבסוף הקטע, אין אפשרות לבטל יותר עם shift + חץ אחורה מאותו הקטע (ולא שא"א לבטל עוד לפני שנבחר ועיין בהסרטה דלעיל).
  • 0 הצבעות
    3 פוסטים
    62 צפיות
    חנניהח
    @י.-פל. אז אולי שימצא את ספרי היברו רק בתקיה הראשית ?
  • 1 הצבעות
    3 פוסטים
    71 צפיות
    Otzaria-BotO
    @יום-חדש-מתחיל נסגרה כעת בעיה בגיטהאב המקושרת לפוסט זה. לפרטים נוספים: https://github.com/Otzaria/otzaria/issues/1157
  • 0 הצבעות
    13 פוסטים
    161 צפיות
    צדיק וטוב לוצ
    @חנניה 🤔 מעניין, תבדוק עם מי התכתבת שם.
  • 2 הצבעות
    8 פוסטים
    158 צפיות
    הבל הבליםה
    @פלמנמוני כתב: אתה מתכוון ללשונית שעוברים אליה? כן.
  • 0 הצבעות
    12 פוסטים
    151 צפיות
    Otzaria-BotO
    @מצפה-לישועת-ה נסגרה כעת בעיה בגיטהאב המקושרת לפוסט זה. לפרטים נוספים: https://github.com/Otzaria/otzaria/issues/1131
  • באג | באג בתוסף מרקר

    תוספים לאוצריא - דיונים באג תוספים מרקר
    6
    0 הצבעות
    6 פוסטים
    88 צפיות
    shmuelS
    @מיכאלוש עכשיו זה עובד מצוין
  • 2 הצבעות
    12 פוסטים
    126 צפיות
    י. פל.י
    @פיני-פ. תקבל בעדכון הספרייה הבא (שיגיע בעז״ה עם התוכנה)
  • בעיה | אתר אוצריה

    נפתר כללי באג התחברות תוספים הורדה אתר
    29
    1
    1 הצבעות
    29 פוסטים
    219 צפיות
    ה
    תודה
  • 0 הצבעות
    6 פוסטים
    67 צפיות
    יאיר דניאלי
    @חד-צורבא בעיות שנפתחות בגיטאב [image: 3701f0ab-0073-4f35-be5f-cc41ec171e02-image.jpeg]
  • 0 הצבעות
    2 פוסטים
    35 צפיות
    פלמנמוניפ
    @M-החושב לדווח על באג יש אפשרות - אם בעל התוסף מימש זאת לדווח על תוסף חשוד יש לפנות לאחראים באישי או באתר אוצריא
  • 0 הצבעות
    19 פוסטים
    221 צפיות
    מוטל2מ
    @Otzaria-Bot מעתיק את תוכן הקובץ, האם אני אמור לעשות כאן משהו? === Initialization Warning 2026-08-30T03:06:39.715832 === Version: 0.9.97+90960 Exception: Exception: רישום פרוטוקול התוספים נכשל: Timed out after 5 seconds Phase: initialize Component: Plugin protocol registration Stack: #0 PluginProtocolRegistrationService._ensureWindowsRegistration (package:otzaria/plugins/services/plugin_protocol_registration_service.dart:54) <asynchronous suspension> #1 PluginProtocolRegistrationService.ensureRegistered (package:otzaria/plugins/services/plugin_protocol_registration_service.dart:23) <asynchronous suspension> #2 _runDeferredProtocolRegistration (package:otzaria/main.dart:741) <asynchronous suspension> === Initialization Warning 2026-08-30T10:04:39.944369 === Version: 0.9.97+90960 Exception: Exception: רישום פרוטוקול התוספים נכשל: Timed out after 5 seconds Phase: initialize Component: Plugin protocol registration Stack: #0 PluginProtocolRegistrationService._ensureWindowsRegistration (package:otzaria/plugins/services/plugin_protocol_registration_service.dart:54) <asynchronous suspension> #1 PluginProtocolRegistrationService.ensureRegistered (package:otzaria/plugins/services/plugin_protocol_registration_service.dart:23) <asynchronous suspension> #2 _runDeferredProtocolRegistration (package:otzaria/main.dart:741) <asynchronous suspension> === Indexing failures 2026-08-30T10:44:01.848031 === Version: 0.9.97+90960 Completed: true Processed: 8919/8919 Indexed: 611 Failures: 15 Retryable: 3 Warnings: 9 --- Failure 1 --- Kind: timeout Retryable: true Book: סוגיית המקדש במלוה ע''פ שיעורי מורינו הגרש''מ אנשין שליט''א Path: C:\Users\User\Documents\מסמכים\ספרים וסיכומים שונים\סיכומים\סיכומים שונים\סוגיית המקדש במלוה ע''פ שיעורי מורינו הגרש''מ אנשין שליט''א.pdf Error: TimeoutException after 0:01:00.000000: Future not completed Stack: #0 Future.timeout.<anonymous closure> (dart:async/future_impl.dart:1042) <asynchronous suspension> #1 IndexingRepository._extractPdfPages (package:otzaria/indexing/repository/indexing_repository.dart:909) <asynchronous suspension> #2 IndexingRepository.extractPdfPagesGuarded (package:otzaria/indexing/repository/indexing_repository.dart:869) <asynchronous suspension> #3 PdfExtractionPrefetcher._start.<anonymous closure> (package:otzaria/indexing/utils/pdf_extraction_prefetcher.dart:152) <asynchronous suspension> --- Failure 2 --- Kind: unknown Retryable: true Book: שבת Path: uid:536 Error: קובץ המסמך פגום [docx] — הרשומה "word/document.xml" פרוסה ל-168141090 בתים Stack: #0 assertSafeArchive.fail (package:otzaria/utils/file/zip_limits.dart:43) #1 assertSafeArchive (package:otzaria/utils/file/zip_limits.dart:59) #2 ooxmlWordToText (package:otzaria/utils/file/docx_to_otzaria.dart:1139) #3 convertOoxmlWordWithCache.<anonymous closure> (package:otzaria/utils/file/docx_cache.dart:65) #4 _convert.<anonymous closure> (package:otzaria/utils/file/docx_cache.dart:240) #5 _RemoteRunner._run (dart:isolate:1116) #6 _RemoteRunner._remoteExecute (dart:isolate:1110) #7 _delayEntrypointInvocation.<anonymous closure> (dart:isolate-patch/isolate_patch.dart:316) #8 _RawReceivePort._handleMessage (dart:isolate-patch/isolate_patch.dart:192) --- Failure 3 --- Kind: unknown Retryable: true Book: הרב פינקוס Path: uid:1009 Error: המסמך מוצפן [docx] — החבילה מוצפנת (מכולת OLE במקום ZIP) Stack: #0 ooxmlWordToText (package:otzaria/utils/file/docx_to_otzaria.dart:1117) #1 convertOoxmlWordWithCache.<anonymous closure> (package:otzaria/utils/file/docx_cache.dart:65) #2 _convert.<anonymous closure> (package:otzaria/utils/file/docx_cache.dart:240) #3 _RemoteRunner._run (dart:isolate:1116) #4 _RemoteRunner._remoteExecute (dart:isolate:1110) #5 _delayEntrypointInvocation.<anonymous closure> (dart:isolate-patch/isolate_patch.dart:316) #6 _RawReceivePort._handleMessage (dart:isolate-patch/isolate_patch.dart:192) --- Failure 4 --- Kind: partialPdf Retryable: false Book: בבא מציעא Path: C:\Users\User\Documents\מסמכים\ספרים וסיכומים שונים\ספרים\גמרא\מתיבתא\ילקוט ביאורים\בבא מציעא.pdf Error: 1 עמודים נשמטו מהחילוץ עקב timeout --- Failure 5 --- Kind: partialPdf Retryable: false Book: ברכות Path: C:\Users\User\Documents\מסמכים\ספרים וסיכומים שונים\ספרים\גמרא\מתיבתא\ילקוט ביאורים\ברכות.pdf Error: 1 עמודים נשמטו מהחילוץ עקב timeout --- Failure 6 --- Kind: partialPdf Retryable: false Book: יומא Path: C:\Users\User\Documents\מסמכים\ספרים וסיכומים שונים\ספרים\גמרא\מתיבתא\ילקוט ביאורים\יומא.pdf Error: 2 עמודים נשמטו מהחילוץ עקב timeout --- Failure 7 --- Kind: partialPdf Retryable: false Book: בבא בתרא Path: C:\Users\User\Documents\מסמכים\ספרים וסיכומים שונים\ספרים\גמרא\מתיבתא\ילקוט ביאורים\בבא בתרא.pdf Error: 1 עמודים נשמטו מהחילוץ עקב timeout --- Failure 8 --- Kind: partialPdf Retryable: false Book: מכות Path: C:\Users\User\Documents\מסמכים\ספרים וסיכומים שונים\ספרים\גמרא\מתיבתא\ילקוט ביאורים\מכות.pdf Error: 1 עמודים נשמטו מהחילוץ עקב timeout --- Failure 9 --- Kind: partialPdf Retryable: false Book: תענית Path: C:\Users\User\Documents\מסמכים\ספרים וסיכומים שונים\ספרים\גמרא\מתיבתא\ילקוט ביאורים\תענית.pdf Error: 1 עמודים נשמטו מהחילוץ עקב timeout --- Failure 10 --- Kind: partialPdf Retryable: false Book: פסחים Path: C:\Users\User\Documents\מסמכים\ספרים וסיכומים שונים\ספרים\גמרא\מתיבתא\ילקוט ביאורים\פסחים.pdf Error: 1 עמודים נשמטו מהחילוץ עקב timeout --- Failure 11 --- Kind: partialPdf Retryable: false Book: שבועות Path: C:\Users\User\Documents\מסמכים\ספרים וסיכומים שונים\ספרים\גמרא\מתיבתא\ילקוט ביאורים\שבועות.pdf Error: 2 עמודים נשמטו מהחילוץ עקב timeout --- Failure 12 --- Kind: passwordProtected Retryable: false Book: משנ''ב חלק ב' Path: C:\Users\User\Documents\מסמכים\ספרים וסיכומים שונים\ספרים\הלכה\משנ''ב\משנ''ב חלק ב'.pdf Error: PdfException: No password supplied by PasswordProvider. Stack: #0 PdfrxEntryFunctionsImpl._openByFunc (package:pdfrx_engine/src/native/pdfrx_pdfium.dart:813) <asynchronous suspension> #1 Future.timeout.<anonymous closure> (dart:async/future_impl.dart:1061) <asynchronous suspension> #2 IndexingRepository._extractPdfPages (package:otzaria/indexing/repository/indexing_repository.dart:909) <asynchronous suspension> #3 IndexingRepository.extractPdfPagesGuarded (package:otzaria/indexing/repository/indexing_repository.dart:869) <asynchronous suspension> #4 PdfExtractionPrefetcher._start.<anonymous closure> (package:otzaria/indexing/utils/pdf_extraction_prefetcher.dart:152) <asynchronous suspension> #5 PdfExtractionPrefetcher._resultOf (package:otzaria/indexing/utils/pdf_extraction_prefetcher.dart:187) <asynchronous suspension> #6 IndexingRepository._indexPdfBook (package:otzaria/indexing/repository/indexing_repository.dart:634) <asynchronous suspension> #7 IndexingRepository.indexAllBooks (package:otzaria/indexing/repository/indexing_repository.dart:409) <asynchronous suspension> #8 IndexingBloc._onStartIndexing (package:otzaria/indexing/bloc/indexing_bloc.dart:178) <asynchronous suspension> #9 IndexingBloc._onIndexingWork (package:otzaria/indexing/bloc/indexing_bloc.dart:44) <asynchronous suspension> #10 Bloc.on.<anonymous closure>.handleEvent (package:bloc/src/bloc.dart:226) <asynchronous suspension> --- Failure 13 --- Kind: partialPdf Retryable: false Book: משנה ברורה עוז והדר ב Path: C:\Users\User\Documents\מסמכים\ספרים וסיכומים שונים\ספרים\הלכה\משנ''ב עוז והדר\משנה ברורה עוז והדר ב.pdf Error: 1 עמודים נשמטו מהחילוץ עקב timeout --- Failure 14 --- Kind: passwordProtected Retryable: false Book: דברים Path: C:\Users\User\Documents\מסמכים\ספרים וסיכומים שונים\ספרים\חומש - מקראות גדולות\דברים.PDF Error: PdfException: No password supplied by PasswordProvider. Stack: #0 PdfrxEntryFunctionsImpl._openByFunc (package:pdfrx_engine/src/native/pdfrx_pdfium.dart:813) <asynchronous suspension> #1 Future.timeout.<anonymous closure> (dart:async/future_impl.dart:1061) <asynchronous suspension> #2 IndexingRepository._extractPdfPages (package:otzaria/indexing/repository/indexing_repository.dart:909) <asynchronous suspension> #3 IndexingRepository.extractPdfPagesGuarded (package:otzaria/indexing/repository/indexing_repository.dart:869) <asynchronous suspension> #4 PdfExtractionPrefetcher._start.<anonymous closure> (package:otzaria/indexing/utils/pdf_extraction_prefetcher.dart:152) <asynchronous suspension> --- Failure 15 --- Kind: passwordProtected Retryable: false Book: נפש שמשון - בעניני אמונה פינקוס, שמשון דוד בן חיים אברהם Path: C:\Users\User\Documents\מסמכים\ספרים וסיכומים שונים\ספרים\שונות\ספרי הרב פינקוס\נפש שמשון - בעניני אמונה פינקוס, שמשון דוד בן חיים אברהם.pdf Error: PdfException: No password supplied by PasswordProvider. Stack: #0 PdfrxEntryFunctionsImpl._openByFunc (package:pdfrx_engine/src/native/pdfrx_pdfium.dart:813) <asynchronous suspension> #1 Future.timeout.<anonymous closure> (dart:async/future_impl.dart:1061) <asynchronous suspension> #2 IndexingRepository._extractPdfPages (package:otzaria/indexing/repository/indexing_repository.dart:909) <asynchronous suspension> #3 IndexingRepository.extractPdfPagesGuarded (package:otzaria/indexing/repository/indexing_repository.dart:869) <asynchronous suspension> #4 PdfExtractionPrefetcher._start.<anonymous closure> (package:otzaria/indexing/utils/pdf_extraction_prefetcher.dart:152) <asynchronous suspension> #5 PdfExtractionPrefetcher._resultOf (package:otzaria/indexing/utils/pdf_extraction_prefetcher.dart:187) <asynchronous suspension> #6 IndexingRepository._indexPdfBook (package:otzaria/indexing/repository/indexing_repository.dart:634) <asynchronous suspension> #7 IndexingRepository.indexAllBooks (package:otzaria/indexing/repository/indexing_repository.dart:409) <asynchronous suspension> #8 IndexingBloc._onStartIndexing (package:otzaria/indexing/bloc/indexing_bloc.dart:178) <asynchronous suspension> #9 IndexingBloc._onIndexingWork (package:otzaria/indexing/bloc/indexing_bloc.dart:44) <asynchronous suspension> #10 Bloc.on.<anonymous closure>.handleEvent (package:bloc/src/bloc.dart:226) <asynchronous suspension> === Indexing failures 2026-08-30T10:51:02.390601 === Version: 0.9.97+90960 Completed: true Processed: 8919/8919 Indexed: 1 Failures: 2 Retryable: 2 Warnings: 0 --- Failure 1 --- Kind: unknown Retryable: true Book: שבת Path: uid:536 Error: קובץ המסמך פגום [docx] — הרשומה "word/document.xml" פרוסה ל-168141090 בתים Stack: #0 assertSafeArchive.fail (package:otzaria/utils/file/zip_limits.dart:43) #1 assertSafeArchive (package:otzaria/utils/file/zip_limits.dart:59) #2 ooxmlWordToText (package:otzaria/utils/file/docx_to_otzaria.dart:1139) #3 convertOoxmlWordWithCache.<anonymous closure> (package:otzaria/utils/file/docx_cache.dart:65) #4 _convert.<anonymous closure> (package:otzaria/utils/file/docx_cache.dart:240) #5 _RemoteRunner._run (dart:isolate:1116) #6 _RemoteRunner._remoteExecute (dart:isolate:1110) #7 _delayEntrypointInvocation.<anonymous closure> (dart:isolate-patch/isolate_patch.dart:316) #8 _RawReceivePort._handleMessage (dart:isolate-patch/isolate_patch.dart:192) --- Failure 2 --- Kind: unknown Retryable: true Book: הרב פינקוס Path: uid:1009 Error: המסמך מוצפן [docx] — החבילה מוצפנת (מכולת OLE במקום ZIP) Stack: #0 ooxmlWordToText (package:otzaria/utils/file/docx_to_otzaria.dart:1117) #1 convertOoxmlWordWithCache.<anonymous closure> (package:otzaria/utils/file/docx_cache.dart:65) #2 _convert.<anonymous closure> (package:otzaria/utils/file/docx_cache.dart:240) #3 _RemoteRunner._run (dart:isolate:1116) #4 _RemoteRunner._remoteExecute (dart:isolate:1110) #5 _delayEntrypointInvocation.<anonymous closure> (dart:isolate-patch/isolate_patch.dart:316) #6 _RawReceivePort._handleMessage (dart:isolate-patch/isolate_patch.dart:192) === Initialization Warning 2026-08-30T12:56:26.896249 === Version: 0.9.97+90960 Exception: Exception: רישום פרוטוקול התוספים נכשל: Timed out after 5 seconds Phase: initialize Component: Plugin protocol registration Stack: #0 PluginProtocolRegistrationService._ensureWindowsRegistration (package:otzaria/plugins/services/plugin_protocol_registration_service.dart:54) <asynchronous suspension> #1 PluginProtocolRegistrationService.ensureRegistered (package:otzaria/plugins/services/plugin_protocol_registration_service.dart:23) <asynchronous suspension> #2 _runDeferredProtocolRegistration (package:otzaria/main.dart:741) <asynchronous suspension> === Initialization Warning 2026-08-30T15:58:57.740447 === Version: 0.9.97+90960 Exception: Exception: רישום פרוטוקול התוספים נכשל: Timed out after 5 seconds Phase: initialize Component: Plugin protocol registration Stack: #0 PluginProtocolRegistrationService._ensureWindowsRegistration (package:otzaria/plugins/services/plugin_protocol_registration_service.dart:54) <asynchronous suspension> #1 PluginProtocolRegistrationService.ensureRegistered (package:otzaria/plugins/services/plugin_protocol_registration_service.dart:23) <asynchronous suspension> #2 _runDeferredProtocolRegistration (package:otzaria/main.dart:741) <asynchronous suspension> === Indexing failures 2026-08-30T16:03:14.524689 === Version: 0.9.97+90960 Completed: true Processed: 9111/9111 Indexed: 0 Failures: 2 Retryable: 2 Warnings: 0 --- Failure 1 --- Kind: unknown Retryable: true Book: שבת Path: uid:536 Error: קובץ המסמך פגום [docx] — הרשומה "word/document.xml" פרוסה ל-168141090 בתים Stack: #0 assertSafeArchive.fail (package:otzaria/utils/file/zip_limits.dart:43) #1 assertSafeArchive (package:otzaria/utils/file/zip_limits.dart:59) #2 ooxmlWordToText (package:otzaria/utils/file/docx_to_otzaria.dart:1139) #3 convertOoxmlWordWithCache.<anonymous closure> (package:otzaria/utils/file/docx_cache.dart:65) #4 _convert.<anonymous closure> (package:otzaria/utils/file/docx_cache.dart:240) #5 _RemoteRunner._run (dart:isolate:1116) #6 _RemoteRunner._remoteExecute (dart:isolate:1110) #7 _delayEntrypointInvocation.<anonymous closure> (dart:isolate-patch/isolate_patch.dart:316) #8 _RawReceivePort._handleMessage (dart:isolate-patch/isolate_patch.dart:192) --- Failure 2 --- Kind: unknown Retryable: true Book: הרב פינקוס Path: uid:1009 Error: המסמך מוצפן [docx] — החבילה מוצפנת (מכולת OLE במקום ZIP) Stack: #0 ooxmlWordToText (package:otzaria/utils/file/docx_to_otzaria.dart:1117) #1 convertOoxmlWordWithCache.<anonymous closure> (package:otzaria/utils/file/docx_cache.dart:65) #2 _convert.<anonymous closure> (package:otzaria/utils/file/docx_cache.dart:240) #3 _RemoteRunner._run (dart:isolate:1116) #4 _RemoteRunner._remoteExecute (dart:isolate:1110) #5 _delayEntrypointInvocation.<anonymous closure> (dart:isolate-patch/isolate_patch.dart:316) #6 _RawReceivePort._handleMessage (dart:isolate-patch/isolate_patch.dart:192) === Initialization Warning 2026-08-30T17:01:36.603727 === Version: 0.9.97+90960 Exception: Exception: רישום פרוטוקול התוספים נכשל: Timed out after 5 seconds Phase: initialize Component: Plugin protocol registration Stack: #0 PluginProtocolRegistrationService._ensureWindowsRegistration (package:otzaria/plugins/services/plugin_protocol_registration_service.dart:54) <asynchronous suspension> #1 PluginProtocolRegistrationService.ensureRegistered (package:otzaria/plugins/services/plugin_protocol_registration_service.dart:23) <asynchronous suspension> #2 _runDeferredProtocolRegistration (package:otzaria/main.dart:741) <asynchronous suspension> === Indexing failures 2026-08-30T17:02:22.421414 === Version: 0.9.97+90960 Completed: true Processed: 9111/9111 Indexed: 0 Failures: 2 Retryable: 2 Warnings: 0 --- Failure 1 --- Kind: unknown Retryable: true Book: שבת Path: uid:536 Error: קובץ המסמך פגום [docx] — הרשומה "word/document.xml" פרוסה ל-168141090 בתים Stack: #0 assertSafeArchive.fail (package:otzaria/utils/file/zip_limits.dart:43) #1 assertSafeArchive (package:otzaria/utils/file/zip_limits.dart:59) #2 ooxmlWordToText (package:otzaria/utils/file/docx_to_otzaria.dart:1139) #3 convertOoxmlWordWithCache.<anonymous closure> (package:otzaria/utils/file/docx_cache.dart:65) #4 _convert.<anonymous closure> (package:otzaria/utils/file/docx_cache.dart:240) #5 _RemoteRunner._run (dart:isolate:1116) #6 _RemoteRunner._remoteExecute (dart:isolate:1110) #7 _delayEntrypointInvocation.<anonymous closure> (dart:isolate-patch/isolate_patch.dart:316) #8 _RawReceivePort._handleMessage (dart:isolate-patch/isolate_patch.dart:192) --- Failure 2 --- Kind: unknown Retryable: true Book: הרב פינקוס Path: uid:1009 Error: המסמך מוצפן [docx] — החבילה מוצפנת (מכולת OLE במקום ZIP) Stack: #0 ooxmlWordToText (package:otzaria/utils/file/docx_to_otzaria.dart:1117) #1 convertOoxmlWordWithCache.<anonymous closure> (package:otzaria/utils/file/docx_cache.dart:65) #2 _convert.<anonymous closure> (package:otzaria/utils/file/docx_cache.dart:240) #3 _RemoteRunner._run (dart:isolate:1116) #4 _RemoteRunner._remoteExecute (dart:isolate:1110) #5 _delayEntrypointInvocation.<anonymous closure> (dart:isolate-patch/isolate_patch.dart:316) #6 _RawReceivePort._handleMessage (dart:isolate-patch/isolate_patch.dart:192) === Indexing failures 2026-08-31T10:42:14.571351 === Version: 0.9.97+90960 Completed: true Processed: 9111/9111 Indexed: 0 Failures: 2 Retryable: 2 Warnings: 0 --- Failure 1 --- Kind: unknown Retryable: true Book: שבת Path: uid:536 Error: קובץ המסמך פגום [docx] — הרשומה "word/document.xml" פרוסה ל-168141090 בתים Stack: #0 assertSafeArchive.fail (package:otzaria/utils/file/zip_limits.dart:43) #1 assertSafeArchive (package:otzaria/utils/file/zip_limits.dart:59) #2 ooxmlWordToText (package:otzaria/utils/file/docx_to_otzaria.dart:1139) #3 convertOoxmlWordWithCache.<anonymous closure> (package:otzaria/utils/file/docx_cache.dart:65) #4 _convert.<anonymous closure> (package:otzaria/utils/file/docx_cache.dart:240) #5 _RemoteRunner._run (dart:isolate:1116) #6 _RemoteRunner._remoteExecute (dart:isolate:1110) #7 _delayEntrypointInvocation.<anonymous closure> (dart:isolate-patch/isolate_patch.dart:316) #8 _RawReceivePort._handleMessage (dart:isolate-patch/isolate_patch.dart:192) --- Failure 2 --- Kind: unknown Retryable: true Book: הרב פינקוס Path: uid:1009 Error: המסמך מוצפן [docx] — החבילה מוצפנת (מכולת OLE במקום ZIP) Stack: #0 ooxmlWordToText (package:otzaria/utils/file/docx_to_otzaria.dart:1117) #1 convertOoxmlWordWithCache.<anonymous closure> (package:otzaria/utils/file/docx_cache.dart:65) #2 _convert.<anonymous closure> (package:otzaria/utils/file/docx_cache.dart:240) #3 _RemoteRunner._run (dart:isolate:1116) #4 _RemoteRunner._remoteExecute (dart:isolate:1110) #5 _delayEntrypointInvocation.<anonymous closure> (dart:isolate-patch/isolate_patch.dart:316) #6 _RawReceivePort._handleMessage (dart:isolate-patch/isolate_patch.dart:192) === Indexing failures 2026-08-31T16:14:08.883202 === Version: 0.9.97+90960 Completed: true Processed: 9111/9111 Indexed: 0 Failures: 2 Retryable: 2 Warnings: 0 --- Failure 1 --- Kind: unknown Retryable: true Book: שבת Path: uid:536 Error: קובץ המסמך פגום [docx] — הרשומה "word/document.xml" פרוסה ל-168141090 בתים Stack: #0 assertSafeArchive.fail (package:otzaria/utils/file/zip_limits.dart:43) #1 assertSafeArchive (package:otzaria/utils/file/zip_limits.dart:59) #2 ooxmlWordToText (package:otzaria/utils/file/docx_to_otzaria.dart:1139) #3 convertOoxmlWordWithCache.<anonymous closure> (package:otzaria/utils/file/docx_cache.dart:65) #4 _convert.<anonymous closure> (package:otzaria/utils/file/docx_cache.dart:240) #5 _RemoteRunner._run (dart:isolate:1116) #6 _RemoteRunner._remoteExecute (dart:isolate:1110) #7 _delayEntrypointInvocation.<anonymous closure> (dart:isolate-patch/isolate_patch.dart:316) #8 _RawReceivePort._handleMessage (dart:isolate-patch/isolate_patch.dart:192) --- Failure 2 --- Kind: unknown Retryable: true Book: הרב פינקוס Path: uid:1009 Error: המסמך מוצפן [docx] — החבילה מוצפנת (מכולת OLE במקום ZIP) Stack: #0 ooxmlWordToText (package:otzaria/utils/file/docx_to_otzaria.dart:1117) #1 convertOoxmlWordWithCache.<anonymous closure> (package:otzaria/utils/file/docx_cache.dart:65) #2 _convert.<anonymous closure> (package:otzaria/utils/file/docx_cache.dart:240) #3 _RemoteRunner._run (dart:isolate:1116) #4 _RemoteRunner._remoteExecute (dart:isolate:1110) #5 _delayEntrypointInvocation.<anonymous closure> (dart:isolate-patch/isolate_patch.dart:316) #6 _RawReceivePort._handleMessage (dart:isolate-patch/isolate_patch.dart:192) === Indexing failures 2026-09-01T09:44:14.329940 === Version: 0.9.97+90960 Completed: true Processed: 9111/9111 Indexed: 0 Failures: 2 Retryable: 2 Warnings: 0 --- Failure 1 --- Kind: unknown Retryable: true Book: שבת Path: uid:536 Error: קובץ המסמך פגום [docx] — הרשומה "word/document.xml" פרוסה ל-168141090 בתים Stack: #0 assertSafeArchive.fail (package:otzaria/utils/file/zip_limits.dart:43) #1 assertSafeArchive (package:otzaria/utils/file/zip_limits.dart:59) #2 ooxmlWordToText (package:otzaria/utils/file/docx_to_otzaria.dart:1139) #3 convertOoxmlWordWithCache.<anonymous closure> (package:otzaria/utils/file/docx_cache.dart:65) #4 _convert.<anonymous closure> (package:otzaria/utils/file/docx_cache.dart:240) #5 _RemoteRunner._run (dart:isolate:1116) #6 _RemoteRunner._remoteExecute (dart:isolate:1110) #7 _delayEntrypointInvocation.<anonymous closure> (dart:isolate-patch/isolate_patch.dart:316) #8 _RawReceivePort._handleMessage (dart:isolate-patch/isolate_patch.dart:192) --- Failure 2 --- Kind: unknown Retryable: true Book: הרב פינקוס Path: uid:1009 Error: המסמך מוצפן [docx] — החבילה מוצפנת (מכולת OLE במקום ZIP) Stack: #0 ooxmlWordToText (package:otzaria/utils/file/docx_to_otzaria.dart:1117) #1 convertOoxmlWordWithCache.<anonymous closure> (package:otzaria/utils/file/docx_cache.dart:65) #2 _convert.<anonymous closure> (package:otzaria/utils/file/docx_cache.dart:240) #3 _RemoteRunner._run (dart:isolate:1116) #4 _RemoteRunner._remoteExecute (dart:isolate:1110) #5 _delayEntrypointInvocation.<anonymous closure> (dart:isolate-patch/isolate_patch.dart:316) #6 _RawReceivePort._handleMessage (dart:isolate-patch/isolate_patch.dart:192) === Library Update Error (checkForUpdate) 2026-09-01T09:44:29.364775 === Version: 0.9.97+90960 Exception: TimeoutException after 0:00:15.000000: Future not completed Stack: #0 Future.timeout.<anonymous closure> (dart:async/future_impl.dart:1042) <asynchronous suspension> #1 GithubLibraryReleaseClient.fetchReleases (package:seforim_library_updater/src/services/github_library_release_client.dart:46) <asynchronous suspension> #2 LibraryUpdateDiscovery.discover (package:seforim_library_updater/src/services/library_update_discovery.dart:54) <asynchronous suspension> #3 LibraryUpdateRepository.checkForUpdate (package:otzaria/library_update/repository/library_update_repository.dart:138) <asynchronous suspension> #4 LibraryUpdateBloc._onStart (package:otzaria/library_update/bloc/library_update_bloc.dart:143) <asynchronous suspension> #5 Bloc.on.<anonymous closure>.handleEvent (package:bloc/src/bloc.dart:226) <asynchronous suspension> === Initialization Warning 2026-09-01T15:53:07.954640 === Version: 0.9.97+90960 Exception: Exception: רישום פרוטוקול התוספים נכשל: Timed out after 5 seconds Phase: initialize Component: Plugin protocol registration Stack: #0 PluginProtocolRegistrationService._ensureWindowsRegistration (package:otzaria/plugins/services/plugin_protocol_registration_service.dart:54) <asynchronous suspension> #1 PluginProtocolRegistrationService.ensureRegistered (package:otzaria/plugins/services/plugin_protocol_registration_service.dart:23) <asynchronous suspension> #2 _runDeferredProtocolRegistration (package:otzaria/main.dart:741) <asynchronous suspension> === Indexing failures 2026-09-01T15:53:10.582821 === Version: 0.9.97+90960 Completed: true Processed: 9111/9111 Indexed: 0 Failures: 2 Retryable: 2 Warnings: 0 --- Failure 1 --- Kind: unknown Retryable: true Book: שבת Path: uid:536 Error: קובץ המסמך פגום [docx] — הרשומה "word/document.xml" פרוסה ל-168141090 בתים Stack: #0 assertSafeArchive.fail (package:otzaria/utils/file/zip_limits.dart:43) #1 assertSafeArchive (package:otzaria/utils/file/zip_limits.dart:59) #2 ooxmlWordToText (package:otzaria/utils/file/docx_to_otzaria.dart:1139) #3 convertOoxmlWordWithCache.<anonymous closure> (package:otzaria/utils/file/docx_cache.dart:65) #4 _convert.<anonymous closure> (package:otzaria/utils/file/docx_cache.dart:240) #5 _RemoteRunner._run (dart:isolate:1116) #6 _RemoteRunner._remoteExecute (dart:isolate:1110) #7 _delayEntrypointInvocation.<anonymous closure> (dart:isolate-patch/isolate_patch.dart:316) #8 _RawReceivePort._handleMessage (dart:isolate-patch/isolate_patch.dart:192) --- Failure 2 --- Kind: unknown Retryable: true Book: הרב פינקוס Path: uid:1009 Error: המסמך מוצפן [docx] — החבילה מוצפנת (מכולת OLE במקום ZIP) Stack: #0 ooxmlWordToText (package:otzaria/utils/file/docx_to_otzaria.dart:1117) #1 convertOoxmlWordWithCache.<anonymous closure> (package:otzaria/utils/file/docx_cache.dart:65) #2 _convert.<anonymous closure> (package:otzaria/utils/file/docx_cache.dart:240) #3 _RemoteRunner._run (dart:isolate:1116) #4 _RemoteRunner._remoteExecute (dart:isolate:1110) #5 _delayEntrypointInvocation.<anonymous closure> (dart:isolate-patch/isolate_patch.dart:316) #6 _RawReceivePort._handleMessage (dart:isolate-patch/isolate_patch.dart:192) === Indexing failures 2026-09-01T17:01:01.994899 === Version: 0.9.97+90960 Completed: true Processed: 9111/9111 Indexed: 0 Failures: 2 Retryable: 2 Warnings: 0 --- Failure 1 --- Kind: unknown Retryable: true Book: שבת Path: uid:536 Error: קובץ המסמך פגום [docx] — הרשומה "word/document.xml" פרוסה ל-168141090 בתים Stack: #0 assertSafeArchive.fail (package:otzaria/utils/file/zip_limits.dart:43) #1 assertSafeArchive (package:otzaria/utils/file/zip_limits.dart:59) #2 ooxmlWordToText (package:otzaria/utils/file/docx_to_otzaria.dart:1139) #3 convertOoxmlWordWithCache.<anonymous closure> (package:otzaria/utils/file/docx_cache.dart:65) #4 _convert.<anonymous closure> (package:otzaria/utils/file/docx_cache.dart:240) #5 _RemoteRunner._run (dart:isolate:1116) #6 _RemoteRunner._remoteExecute (dart:isolate:1110) #7 _delayEntrypointInvocation.<anonymous closure> (dart:isolate-patch/isolate_patch.dart:316) #8 _RawReceivePort._handleMessage (dart:isolate-patch/isolate_patch.dart:192) --- Failure 2 --- Kind: unknown Retryable: true Book: הרב פינקוס Path: uid:1009 Error: המסמך מוצפן [docx] — החבילה מוצפנת (מכולת OLE במקום ZIP) Stack: #0 ooxmlWordToText (package:otzaria/utils/file/docx_to_otzaria.dart:1117) #1 convertOoxmlWordWithCache.<anonymous closure> (package:otzaria/utils/file/docx_cache.dart:65) #2 _convert.<anonymous closure> (package:otzaria/utils/file/docx_cache.dart:240) #3 _RemoteRunner._run (dart:isolate:1116) #4 _RemoteRunner._remoteExecute (dart:isolate:1110) #5 _delayEntrypointInvocation.<anonymous closure> (dart:isolate-patch/isolate_patch.dart:316) #6 _RawReceivePort._handleMessage (dart:isolate-patch/isolate_patch.dart:192) === Indexing failures 2026-09-02T10:03:53.618344 === Version: 0.9.97+90960 Completed: true Processed: 9111/9111 Indexed: 0 Failures: 2 Retryable: 2 Warnings: 0 --- Failure 1 --- Kind: unknown Retryable: true Book: שבת Path: uid:536 Error: קובץ המסמך פגום [docx] — הרשומה "word/document.xml" פרוסה ל-168141090 בתים Stack: #0 assertSafeArchive.fail (package:otzaria/utils/file/zip_limits.dart:43) #1 assertSafeArchive (package:otzaria/utils/file/zip_limits.dart:59) #2 ooxmlWordToText (package:otzaria/utils/file/docx_to_otzaria.dart:1139) #3 convertOoxmlWordWithCache.<anonymous closure> (package:otzaria/utils/file/docx_cache.dart:65) #4 _convert.<anonymous closure> (package:otzaria/utils/file/docx_cache.dart:240) #5 _RemoteRunner._run (dart:isolate:1116) #6 _RemoteRunner._remoteExecute (dart:isolate:1110) #7 _delayEntrypointInvocation.<anonymous closure> (dart:isolate-patch/isolate_patch.dart:316) #8 _RawReceivePort._handleMessage (dart:isolate-patch/isolate_patch.dart:192) --- Failure 2 --- Kind: unknown Retryable: true Book: הרב פינקוס Path: uid:1009 Error: המסמך מוצפן [docx] — החבילה מוצפנת (מכולת OLE במקום ZIP) Stack: #0 ooxmlWordToText (package:otzaria/utils/file/docx_to_otzaria.dart:1117) #1 convertOoxmlWordWithCache.<anonymous closure> (package:otzaria/utils/file/docx_cache.dart:65) #2 _convert.<anonymous closure> (package:otzaria/utils/file/docx_cache.dart:240) #3 _RemoteRunner._run (dart:isolate:1116) #4 _RemoteRunner._remoteExecute (dart:isolate:1110) #5 _delayEntrypointInvocation.<anonymous closure> (dart:isolate-patch/isolate_patch.dart:316) #6 _RawReceivePort._handleMessage (dart:isolate-patch/isolate_patch.dart:192) === Indexing failures 2026-09-02T10:04:07.052355 === Version: 0.9.97+90960 Completed: true Processed: 9111/9111 Indexed: 0 Failures: 2 Retryable: 2 Warnings: 0 --- Failure 1 --- Kind: unknown Retryable: true Book: שבת Path: uid:536 Error: קובץ המסמך פגום [docx] — הרשומה "word/document.xml" פרוסה ל-168141090 בתים Stack: #0 assertSafeArchive.fail (package:otzaria/utils/file/zip_limits.dart:43) #1 assertSafeArchive (package:otzaria/utils/file/zip_limits.dart:59) #2 ooxmlWordToText (package:otzaria/utils/file/docx_to_otzaria.dart:1139) #3 convertOoxmlWordWithCache.<anonymous closure> (package:otzaria/utils/file/docx_cache.dart:65) #4 _convert.<anonymous closure> (package:otzaria/utils/file/docx_cache.dart:240) #5 _RemoteRunner._run (dart:isolate:1116) #6 _RemoteRunner._remoteExecute (dart:isolate:1110) #7 _delayEntrypointInvocation.<anonymous closure> (dart:isolate-patch/isolate_patch.dart:316) #8 _RawReceivePort._handleMessage (dart:isolate-patch/isolate_patch.dart:192) --- Failure 2 --- Kind: unknown Retryable: true Book: הרב פינקוס Path: uid:1009 Error: המסמך מוצפן [docx] — החבילה מוצפנת (מכולת OLE במקום ZIP) Stack: #0 ooxmlWordToText (package:otzaria/utils/file/docx_to_otzaria.dart:1117) #1 convertOoxmlWordWithCache.<anonymous closure> (package:otzaria/utils/file/docx_cache.dart:65) #2 _convert.<anonymous closure> (package:otzaria/utils/file/docx_cache.dart:240) #3 _RemoteRunner._run (dart:isolate:1116) #4 _RemoteRunner._remoteExecute (dart:isolate:1110) #5 _delayEntrypointInvocation.<anonymous closure> (dart:isolate-patch/isolate_patch.dart:316) #6 _RawReceivePort._handleMessage (dart:isolate-patch/isolate_patch.dart:192)
  • 0 הצבעות
    1 פוסטים
    27 צפיות
    אין תגובות
  • 1 הצבעות
    3 פוסטים
    71 צפיות
    Otzaria-BotO
    @m-החושב נסגרה כעת בעיה בגיטהאב המקושרת לפוסט זה. לפרטים נוספים: https://github.com/Otzaria/otzaria/issues/1094